{"text_format":"1","workbook":"xlsx","n_sheets":6,"sheets":["Main","Procedure","Competencies Table","Lists","Competency Working","Workbook Parameters"],"not_rendered":{"charts":0,"images":3,"macros":1,"external_links":0,"defined_names":44,"comments":0,"pivot_tables":0},"unopened":[],"bounds":{"document_bytes":16777216,"sheet_cells":100000,"rows_first":2000,"rows_last":500,"rows_between":2000,"halvings":0,"cell_chars":16384,"cell_head_chars":4096},"cells_cut":0,"cells_raw":0,"read":"whole","date_system":"1900"}

{"sheet":"Main","index":0,"n_rows":131,"n_cols":14,"rows_kept":131,"cut":false,"hidden":false,"merged":[[125,10,125,13],[14,10,14,12],[16,12,16,13],[90,10,90,13],[92,10,92,13],[94,10,94,13],[49,10,49,13],[20,12,20,13],[50,10,50,13],[85,10,85,13],[51,10,51,13],[52,10,52,11],[71,10,71,13],[61,10,61,11],[66,10,66,11],[56,12,56,13],[55,12,55,13],[54,12,54,13],[57,12,57,13],[58,10,58,11],[59,10,59,11],[58,12,58,13],[59,12,59,13],[62,12,62,13],[121,10,121,13],[99,10,99,13],[100,10,100,13],[101,10,101,13],[102,10,102,13],[53,10,53,11],[54,10,54,11],[55,10,55,11],[56,10,56,11],[57,10,57,11],[53,12,53,13],[62,10,62,11],[103,10,103,13],[123,10,123,13],[21,10,21,13],[116,10,116,13],[117,10,117,13],[118,10,118,13],[119,10,119,13],[120,10,120,13],[111,10,111,13],[112,10,112,13],[122,10,122,13],[67,11,67,13],[68,11,68,13],[69,11,69,13],[113,10,113,13],[114,10,114,13],[115,10,115,13],[63,12,63,13],[63,10,63,11],[95,10,95,13],[96,10,96,13],[87,10,87,13],[104,10,104,13],[97,10,97,13],[98,10,98,13],[76,10,76,13],[77,10,77,13],[65,10,65,13],[74,10,74,13]]}
[null,{"$f":"INDEX(C1:I1,$B$2)","v":0},0,{"$f":"IFERROR(INDEX(Lists!$C$3:$C$4,Main!D2),\"\")","v":"Mechanical"},{"$f":"IFERROR(INDEX(Lists!$C$3:$C$4,Main!E2),\"\")","v":"Electrical"},null,{"$f":"IFERROR(INDEX(Lists!$C$3:$C$4,Main!G2),\"\")","v":""},{"$f":"IFERROR(INDEX(Lists!$C$3:$C$4,Main!H2),\"\")","v":""},{"$f":"IFERROR(INDEX(Lists!$C$3:$C$4,Main!I2),\"\")","v":""},null,"(Always use/download latest form from nswecinductions.com.au)",null,{"$f":"IF(AdminAccess=TRUE,\"WARNING: Admin Mode On\",\"\")","v":""},"Contractor Form Version 3.7"]
["Indexes:",{"$f":"MATCH(L17,C1:I1,0)","v":1},0,1,2,3,4,5,6]
[null,{"$f":"INDEX(C3:I3,$B$2)","v":"Yes"},"Yes","Yes","Yes",null,null,null,null,null,{"$f":"\"Statutory Appointment Letter - \"&L17","v":"Statutory Appointment Letter - "},null,null,"CF Version 3.7"]
[null,"Yes","Yes","Yes","Yes"]
[null,"Yes","Yes","Yes","Yes",null,null,null,null,null,"* Surname:",null,"* Given Names:"]
[null,"Yes","Yes","Yes","Yes"]
[null,"Yes","Yes","Yes","Yes",null,null,null,null,null,"* Date of Birth (DD/MM/YYYY):",null,"* Occupation:"]
[null,"Yes","Yes","Yes","Yes"]
[null,"Yes","Yes","Yes","Yes",null,null,null,null,null,"* Certifcate of Proficiency or Equiv:",null,"Qualifications - Other:"]
[null,"Yes","Yes","Yes","Yes"]
{"$rows_left_out":122}
{"sheet":"Procedure","index":1,"n_rows":17,"n_cols":22,"rows_kept":17,"cut":false,"hidden":false,"merged":[]}
[]
[null,null,null,null,null,null,null,null,null,null,null,null,null,null,null,null,null,null,null,null,null,"Reference Documents"]
[]
[null,null,null,null,null,null,null,null,null,null,null,null,null,null,null,null,null,null,null,null,null,"To review the below documents please access Tempo (see PDF below for access/navigation details)"]
[]
[null,null,null,null,null,null,null,null,null,null,null,null,null,null,null,null,null,null,null,null,null,"- MAC-MEC-STD-013 Mechanical Competency"]
[null,null,null,null,null,null,null,null,null,null,null,null,null,null,null,null,null,null,null,null,null,"- MAC-STE-STD-144 Managing Risks from High Pressure Jetting"]
[null,null,null,null,null,null,null,null,null,null,null,null,null,null,null,null,null,null,null,null,null,"- MAC-ENG-STD-006 Tyres & Rims"]
[]
[]
{"$rows_left_out":8}
{"sheet":"Competencies Table","index":2,"n_rows":26,"n_cols":76,"rows_kept":26,"cut":false,"hidden":true,"merged":[]}
[]
[null,null,null,null,null,null,null,null,null,null,null,null,null,null,null,null,null,null,null,null,null,null,null,null,null,null,null,null,null,null,null,null,null,null,null,null,null,null,null,null,null,null,null,null,null,null,null,null,null,null,null,null,null,null,null,null,null,null,"Electrical Data from here on ------->"]
[]
[]
["Competency Name:",null,"Apprentice - Mobile Plant Technician","Apprentice - Mechanical Fitter (Fixed Plant)","Apprentice - Fabrication Trade (Boilermaking)","Apprentice - Mechanical Trade (Other)","Apprentice - Building Trade (Plumber & Gas Fitter)","Apprentice - Building Trade (Building & Carpentry)","Apprentice - Building Trade (Other)","Automotive mechanic  - Body maker","Automotive mechanic - Brake mechanic","Automotive mechanic - Exhaust repairer","Automotive mechanic - Motor Mechanic","Automotive mechanic - Front end specialist","Automotive mechanic - Vehicle painter","Automotive mechanic - Panel beater","Automotive mechanic - Radiator repairer","Automotive mechanic - Transmission specialist","Automotive mechanic - Medium and HV","Automotive mechanic - HV mechanic mobile plant","Mechanical Engineer","Structural engineer","Fixed plant - Mechanical fitter","Fixed plant - Engineering Trade","Fixed plant - Mechanical trade","Fixed plant - Fitter and turner","OEM technician non trade role","OEM technician - diesel engines","OEM Technician - Trade","Belt Technician - Splicing","Belt Technician - Clipping","Crane inspector","Equipment compliance inspectors","Fire system technicians - Installers","Fire system technicians - Maintainers","Hydraulic and pneumatic hose service technician","Hydraulic and pneumatic maintenance and repairs","Lifting equipment inspector","Building work","Plumbing work","Gas fitting work","Installation or maintenance of certain refrigeration systems","Pressure vessel inspector","Surface preparation and coating application","Tyre fitter > 600mm","Tyre fitter -  < 600mm","Mobile Plant","Serviceperson of Mobile Plant","Welder - NDT test technician","Welder - Welding inspector","Welder - Basic Welding & fabrication","Welder - Intermediate Welding & fabrication","Welder - Advanced Welding & fabrication","Welder - boiler, pressure vessel, pressure piping or high quality welded application","Welder - Poly Welding","Non-recognised qualification / skills","Category 3 Lift Supervisor","Operate Pressure Washer","Qualified Electrical Engineer","Electrical Engineer","Specialist Engineer","Electrical Supervisor","High Voltage","High Voltage Permit Holder/ Verifier","Low Voltage","Extra Low Voltage","Electrical Technician","Auto Electrical","Fibre Optics and Data Technician","Air conditioning, refrigeration","Electrical Apprentices - Trades Assist","Overhead Line Workers","Trailing and Reeler Cable Repairers","Explosion Protected Equip - Wiring Syst","Radiation Technician","Column1"]
["Discipline:",null,"Mechanical","Mechanical","Mechanical","Mechanical","Mechanical","Mechanical","Mechanical","Mechanical","Mechanical","Mechanical","Mechanical","Mechanical","Mechanical","Mechanical","Mechanical","Mechanical","Mechanical","Mechanical","Mechanical","Mechanical","Mechanical","Mechanical","Mechanical","Mechanical","Mechanical","Mechanical","Mechanical","Mechanical","Mechanical","Mechanical","Mechanical","Mechanical","Mechanical","Mechanical","Mechanical","Mechanical","Mechanical","Mechanical","Mechanical","Mechanical","Mechanical","Mechanical","Mechanical","Mechanical","Mechanical","Mechanical","Mechanical","Mechanical","Mechanical","Mechanical","Mechanical","Mechanical","Mechanical","Mechanical","Mechanical","Mechanical","Electrical","Electrical","Electrical","Electrical","Electrical","Electrical","Electrical","Electrical","Electrical","Electrical","Electrical","Electrical","Electrical","Electrical","Electrical","Electrical","Electrical"]
["Level of Supervision Required:",null,"General","General","General","General","General","General","General","General","General","General","General","General","General","General","General","General","General","General","General","General","General","General","General","General","General","General","General","General","General","General","General","General","General","General","General","General","General","General","General","General","General","General","General","General","General","General","General","General","General","General","General","General","General","General","General","General","General","General","General","General","General","General","General","General","General","General","General","General","Direct","General","General","General","General"]
["Competencies:",null,"* Letter of Introduction ","* Letter of Introduction ","* Letter of Introduction ","* Letter of Introduction ","* Letter of Introduction ","* Letter of Introduction ","* Letter of Introduction ","* Statement of Competency","* Statement of Competency","* Statement of Competency","* Statement of Competency","* Statement of Competency","* Statement of Competency","* Statement of Competency","* Statement of Competency","* Statement of Competency","* Statement of Competency","* Statement of Competency","* Statement of Competency","* Statement of Competency","* Statement of Competency","* Statement of Competency","* Statement of Competency","* Statement of Competency","* Statement of Competency","* Statement of Competency","* Statement of Competency","* Statement of Competency","* Statement of Competency","* Statement of Competency","* Statement of Competency","* Statement of Competency","* Statement of Competency","* Statement of Competency","* Statement of Competency","* Statement of Competency","* Statement of Competency","* Statement of Competency","* Statement of Competency","* Statement of Competency","* Statement of Competency","* Statement of Competency","* Statement of Competency","* Statement of Competency","* Statement of Competency","* Statement of Competency","* Statement of Competency","* Statement of Competency","* Statement of Competency","* Statement of Competency","* Statement of Competency","* Statement of Competency","* Statement of Competency","* Statement of Competency","* Statement of Competency","* Statement of Competency","* Statement of Competency","* Statement of Competency","* Statement of Competency","* Statement of Competency","* Statement of Competency","* Statement of Competency","* Statement of Competency","* Statement of Competency","* Statement of Competency","* Statement of Competency","* Statement of Competency","* Statement of Competency","* Statement of Competency","* Statement of Competency","* Statement of Competency","* Statement of Competency","* Statement of Competency"]
[null,null,"T ","T ","T ","T ","T ","T ","T ","T ","T ","T ","T ","T ","T ","T ","T ","T ","T ","T ","T ","T ","T ","T ","T ","T ","T ","T ","T ","T ","T ","T ","T ","T ","T ","T ","T ","T ","T ","T ","T ","T ","T ","T ","T ","T ","T ","T ","T ","T ","T ","T ","T ","T ","T ","T ","T ","T ","Relevant Trade/Engineering Certificate","Relevant Trade/Engineering Certificate","Relevant Trade/Engineering Certificate","* Relevant Trade/Engineering Certificate","* Relevant Trade/Engineering Certificate","Relevant Trade/Engineering Certificate","* Relevant Trade/Engineering Certificate","* Relevant Trade/Engineering Certificate","* Relevant Trade/Engineering Certificate","* Relevant Trade/Engineering Certificate","Relevant Trade/Engineering Certificate","* Relevant Trade/Engineering Certificate","Relevant Trade/Engineering Certificate","* Relevant Trade/Engineering Certificate","Relevant Trade/Engineering Certificate","* Relevant Trade/Engineering Certificate","* Recognised Training"]
[null,null,"* Apprentice Training Agreement/Contract","* Apprentice Training Agreement/Contract","* Apprentice Training Agreement/Contract","* Apprentice Training Agreement/Contract","* Apprentice Training Agreement/Contract","* Apprentice Training Agreement/Contract","* Apprentice Training Agreement/Contract","* Compliance with MAC-MEC-STD-013 section 9.1","* Compliance with MAC-MEC-STD-013 section 9.1","* Compliance with MAC-MEC-STD-013 section 9.1","* Compliance with MAC-MEC-STD-013 section 9.1","* Compliance with MAC-MEC-STD-013 section 9.1","* Compliance with MAC-MEC-STD-013 section 9.1","* Compliance with MAC-MEC-STD-013 section 9.1","* Compliance with MAC-MEC-STD-013 section 9.1","* Compliance with MAC-MEC-STD-013 section 9.1","* Compliance with MAC-MEC-STD-013 section 9.2","* Compliance with MAC-MEC-STD-013 section 9.3","* Compliance with MAC-MEC-STD-013 section 10.2","* Compliance with MAC-MEC-STD-013 section 10.3","* Compliance with MAC-MEC-STD-013 section 11.1","* Compliance with MAC-MEC-STD-013 section 11.1","* Compliance with MAC-MEC-STD-013 section 11.1","* Compliance with MAC-MEC-STD-013 section 11.1","* Compliance with MAC-MEC-STD-013 section 12.1","* Compliance with MAC-MEC-STD-013 section 12.2","* Compliance with MAC-MEC-STD-013 section 12.3","* Compliance with MAC-MEC-STD-013 section 13.3","* Compliance with MAC-MEC-STD-013 section 13.3","* Compliance with MAC-MEC-STD-013 section 13.5","* Compliance with MAC-MEC-STD-013 section 13.7","* Compliance with MAC-MEC-STD-013 section 13.8","* Compliance with MAC-MEC-STD-013 section 13.8","* Compliance with MAC-MEC-STD-013 section 13.9","* Compliance with MAC-MEC-STD-013 section 13.10","* Compliance with MAC-STE-STD-148 section 6.2","* Compliance with MAC-MEC-STD-013 section 13.13","* Compliance with MAC-MEC-STD-013 section 13.13","* Compliance with MAC-MEC-STD-013 section 13.13","* Compliance with MAC-MEC-STD-013 section 13.13","* Compliance with MAC-MEC-STD-013 section 13.14","* Compliance with MAC-MEC-STD-013 section 13.16","* Compliance with MAC-ENG-STD-006 section 10.1","* Compliance with MAC-ENG-STD-006 section 10.1","* Compliance with MAC-MEC-STD-013 section 15.1","* Compliance with MAC-MEC-STD-013 section 15.2","* Compliance with MAC-MEC-STD-013 section 16.1","* Compliance with MAC-MEC-STD-013 section 16.1","* Compliance with MAC-MEC-STD-013 section 16.2","* Compliance with MAC-MEC-STD-013 section 16.2","* Compliance with MAC-MEC-STD-013 section 16.2","* Compliance with MAC-MEC-STD-013 section 16.2","* Compliance with MAC-MEC-STD-013 section 16.2","* Compliance with MAC-MEC-STD-013 section 17.1","* Intermediate Rigger (RI) or Advanced Rigger (RA) High Risk Work Licence","* Compliance with MAC-STE-STD-144 section 6.5","* Engineering Qualifications Recognised by Engineers Australia","* Engineering Qualifications Recognised by Engineers Australia","* Engineering Qualifications Recognised by Engineers Australia","Engineering Qualifications Recognised by Engineers Australia","Engineering Qualifications Recognised by Engineers Australia","Engineering Qualifications Recognised by Engineers Australia","Engineering Qualifications Recognised by Engineers Australia","Engineering Qualifications Recognised by Engineers Australia","Engineering Qualifications Recognised by Engineers Australia","Engineering Qualifications Recognised by Engineers Australia","Engineering Qualifications Recognised by Engineers Australia","Engineering Qualifications Recognised by Engineers Australia","Engineering Qualifications Recognised by Engineers Australia","Engineering Qualifications Recognised by Engineers Australia","Engineering Qualifications Recognised by Engineers Australia","* Recognised Training","* S10 Radiation User Licence issued by NSW EPA"]
{"$rows_left_out":17}
{"sheet":"Lists","index":3,"n_rows":76,"n_cols":8,"rows_kept":76,"cut":false,"hidden":true,"merged":[]}
[]
[null,null,"Discipline Max 6 Permitted",null,null,null,"Competency","Pegasus Code"]
[null,null,"Mechanical",null,null,null,"Apprentice - Mobile Plant Technician","This appointment is not valid until it has been uploaded into Pegasus. Please upload against the role \"Apprentice - Mobile Plant Technician\"  This is your Company's responsibility to organise and must be done prior to commencing at Mt Arthur Coal."]
[null,null,"Electrical",null,null,null,"Apprentice - Mechanical Fitter (Fixed Plant)","This appointment is not valid until it has been uploaded into Pegasus. Please upload against the role \"Apprentice - Mechanical Fitter (Fixed Plant)\"  This is your Company's responsibility to organise and must be done prior to commencing at Mt Arthur Coal."]
[null,null,null,null,null,null,"Automotive mechanic  - Body maker","This appointment is not valid until it has been uploaded into Pegasus. Please upload against the role \"Automotive mechanic  - Body maker\"  This is your Company's responsibility to organise and must be done prior to commencing at Mt Arthur Coal."]
[null,null,null,null,null,null,"Automotive mechanic - Brake mechanic","This appointment is not valid until it has been uploaded into Pegasus. Please upload against the role \"Automotive mechanic - Brake mechanic\"  This is your Company's responsibility to organise and must be done prior to commencing at Mt Arthur Coal."]
[null,null,null,null,null,null,"Automotive mechanic - Exhaust repairer","This appointment is not valid until it has been uploaded into Pegasus. Please upload against the role \"Automotive mechanic - Exhaust repairer\"  This is your Company's responsibility to organise and must be done prior to commencing at Mt Arthur Coal."]
[null,null,null,null,null,null,"Automotive mechanic - Motor Mechanic","This appointment is not valid until it has been uploaded into Pegasus. Please upload against the role \"Automotive mechanic - Motor Mechanic\"  This is your Company's responsibility to organise and must be done prior to commencing at Mt Arthur Coal."]
[null,null,null,null,null,null,"Automotive mechanic - Front end specialist","This appointment is not valid until it has been uploaded into Pegasus. Please upload against the role \"Auto mechanic - Front end specialist\"  This is your Company's responsibility to organise and must be done prior to commencing at Mt Arthur Coal."]
[null,null,null,null,null,null,"Automotive mechanic - Vehicle painter","This appointment is not valid until it has been uploaded into Pegasus. Please upload against the role \"Automotive mechanic - Vehicle painter\"  This is your Company's responsibility to organise and must be done prior to commencing at Mt Arthur Coal."]
{"$rows_left_out":67}
{"sheet":"Competency Working","index":4,"n_rows":105,"n_cols":10,"rows_kept":105,"cut":false,"hidden":true,"merged":[]}
[]
[null,null,null,null,"AllAccepted",{"$f":"IF(OR(CompetencyAreaInput=\"\",COUNTIF(MobilePlantTable,FALSE)>0),FALSE,TRUE)","v":false}]
[]
[]
[null,null,"Selected Competency Area","Checkbox Value","Mandatory","Accepted"]
[3,null,{"$f":"T(IFERROR(INDEX('Competencies Table'!$C$6:$BX$39,$A6,'Workbook Parameters'!$B$3),\"\"))","v":""},false,{"$f":"LEFT(C6)=\"*\"","v":false},{"$f":"IF(E6,D6,TRUE)","v":true},null,false,{"$f":"IF(H6=TRUE,#REF!+1,#REF!)","v":{"$error":"#REF!"}},{"$f":"IF(H6=TRUE,#REF!,\"\")","v":""}]
[4,null,{"$f":"T(IFERROR(INDEX('Competencies Table'!$C$6:$BX$39,$A7,'Workbook Parameters'!$B$3),\"\"))","v":""},false,false,true,null,false,{"$f":"IF(H7=TRUE,I6+1,I6)","v":{"$error":"#REF!"}},{"$f":"IF(H7=TRUE,#REF!,\"\")","v":""}]
[5,null,{"$f":"T(IFERROR(INDEX('Competencies Table'!$C$6:$BX$39,$A8,'Workbook Parameters'!$B$3),\"\"))","v":""},false,false,true,null,false,{"$error":"#REF!"},{"$f":"IF(H8=TRUE,#REF!,\"\")","v":""}]
[6,null,{"$f":"T(IFERROR(INDEX('Competencies Table'!$C$6:$BX$39,$A9,'Workbook Parameters'!$B$3),\"\"))","v":""},false,false,true,null,false,{"$error":"#REF!"},{"$f":"IF(H9=TRUE,#REF!,\"\")","v":""}]
[7,null,{"$f":"T(IFERROR(INDEX('Competencies Table'!$C$6:$BX$39,$A10,'Workbook Parameters'!$B$3),\"\"))","v":""},false,false,true,null,false,{"$error":"#REF!"},{"$f":"IF(H10=TRUE,#REF!,\"\")","v":""}]
{"$rows_left_out":96}
{"sheet":"Workbook Parameters","index":5,"n_rows":5,"n_cols":2,"rows_kept":5,"cut":false,"hidden":true,"merged":[]}
[]
[]
["CompetencyColumn",{"$f":"MATCH(CompetencyAreaInput,'Competencies Table'!$C$5:$BX$5,0)","v":{"$error":"#N/A"}}]
["SupervisionRequired",{"$f":"T(IFERROR(INDEX('Competencies Table'!$C$6:$BX$39,2,B3),\"\"))","v":""}]
["AdminAccess",false]